Reaction Details
TargetProstaglandin G/H synthase 1
LigandBDBM50049030
Substrate/Competitorn/a
Meas. Tech.ChEMBL_158921 (CHEMBL763485)
IC50 4040±n/a nM
Citation Huang, HCLi, JJGarland, DJChamberlain, TSReinhard, EJManning, RESeibert, KKoboldt, CMGregory, SAAnderson, GDVeenhuizen, AWZhang, YPerkins, WEBurton, EGCogburn, JNIsakson, PCReitz, DB Diarylspiro[2.4]heptenes as orally active, highly selective cyclooxygenase-2 inhibitors: synthesis and structure-activity relationships. J Med Chem39:253-66 (1996) 
 
Prostaglandin G/H synthase 1
Name:Prostaglandin G/H synthase 1
Type:Enzyme
Mol. Mass.:68692.62
Organism:Homo sapiens (Human)
Description:P23219
Residue:599
BDBM50049030
NameBDBM50049030
Synonyms:5-(4-Methanesulfonyl-phenyl)-6-p-tolyl-spiro[2.4]hept-5-ene | CHEMBL92102
TypeSmall organic molecule
Emp. Form.C21H22O2S
Mol. Mass.338.463
SMILESCc1ccc(cc1)C1=C(CC2(CC2)C1)c1ccc(cc1)S(C)(=O)=O