Reaction Details
TargetProstaglandin G/H synthase 2
LigandBDBM50049010
Substrate/Competitorn/a
Meas. Tech.ChEMBL_159916 (CHEMBL768965)
IC50 3±n/a nM
Citation Huang, HCLi, JJGarland, DJChamberlain, TSReinhard, EJManning, RESeibert, KKoboldt, CMGregory, SAAnderson, GDVeenhuizen, AWZhang, YPerkins, WEBurton, EGCogburn, JNIsakson, PCReitz, DB Diarylspiro[2.4]heptenes as orally active, highly selective cyclooxygenase-2 inhibitors: synthesis and structure-activity relationships. J Med Chem39:253-66 (1996) 
 
Prostaglandin G/H synthase 2
Name:Prostaglandin G/H synthase 2
Type:Enzyme
Mol. Mass.:69003.89
Organism:Homo sapiens (Human)
Description:Recombinant Cox-2 provided by Cayman (Cayman Chemical Co.,Ann Arbor, MI).
Residue:604
BDBM50049010
NameBDBM50049010
Synonyms:4-[6-(3,4-Difluoro-phenyl)-spiro[2.4]hept-5-en-5-yl]-benzenesulfonamide | CHEMBL314225
TypeSmall organic molecule
Emp. Form.C19H17F2NO2S
Mol. Mass.361.406
SMILESNS(=O)(=O)c1ccc(cc1)C1=C(CC2(CC2)C1)c1ccc(F)c(F)c1