Reaction Details
TargetProstaglandin G/H synthase 2
LigandBDBM50029614
Substrate/Competitorn/a
Meas. Tech.ChEMBL_159916 (CHEMBL768965)
IC50 2.6±n/a nM
Citation Huang, HCLi, JJGarland, DJChamberlain, TSReinhard, EJManning, RESeibert, KKoboldt, CMGregory, SAAnderson, GDVeenhuizen, AWZhang, YPerkins, WEBurton, EGCogburn, JNIsakson, PCReitz, DB Diarylspiro[2.4]heptenes as orally active, highly selective cyclooxygenase-2 inhibitors: synthesis and structure-activity relationships. J Med Chem39:253-66 (1996) 
 
Prostaglandin G/H synthase 2
Name:Prostaglandin G/H synthase 2
Type:Enzyme
Mol. Mass.:69003.89
Organism:Homo sapiens (Human)
Description:Recombinant Cox-2 provided by Cayman (Cayman Chemical Co.,Ann Arbor, MI).
Residue:604
BDBM50029614
NameBDBM50029614
Synonyms:(SC-57666)1-[2-(4-fluorophenyl)-1-cyclopentenyl]-4-methylsulfonylbenzene 1-[2-(4-fluorophenyl)-1-cyclopentenyl]-4-methylsulfonylbenzene 1-fluoro-4-{2-[4-(methylsulfonyl)phenyl]cyclopent-1-en-1-yl}benzene SC-57666
TypeSmall organic molecule
Emp. Form.C18H17FO2S
Mol. Mass.316.39
SMILESCS(=O)(=O)c1ccc(cc1)C1=C(CCC1)c1ccc(F)cc1