Reaction Details
TargetDihydrofolate reductase
LigandBDBM50049896
Substrate/Competitorn/a
Meas. Tech.ChEMBL_54280 (CHEMBL669873)
Ki 30±n/a nM
Citation Kuyper, LFBaccanari, DPJones, MLHunter, RNTansik, RLJoyner, SSBoytos, CMRudolph, SKKnick, VWilson, HRCaddell, JMFriedman, HSComley, JCStables, JN High-affinity inhibitors of dihydrofolate reductase: antimicrobial and anticancer activities of 7,8-dialkyl-1,3-diaminopyrrolo[3,2-f]quinazolines with small molecular size. J Med Chem39:892-903 (1996) 
 
Dihydrofolate reductase
Name:Dihydrofolate reductase
Type:Enzyme
Mol. Mass.:21453.99
Organism:Homo sapiens (Human)
Description:Recombinant human DHFR.
Residue:187
BDBM50049896
NameBDBM50049896
Synonyms:8-Butyl-7-tert-butyl-7H-pyrrolo[3,2-f]quinazoline-1,3-diamine | CHEMBL171629
TypeSmall organic molecule
Emp. Form.C18H25N5
Mol. Mass.311.4246
SMILESCCCCc1cc2c(ccc3nc(N)nc(N)c23)n1C(C)(C)C