Reaction Details
TargetDihydrofolate reductase
LigandBDBM18268
Substrate/Competitorn/a
Meas. Tech.ChEMBL_54280 (CHEMBL669873)
Ki 1.4±n/a nM
Citation Kuyper, LFBaccanari, DPJones, MLHunter, RNTansik, RLJoyner, SSBoytos, CMRudolph, SKKnick, VWilson, HRCaddell, JMFriedman, HSComley, JCStables, JN High-affinity inhibitors of dihydrofolate reductase: antimicrobial and anticancer activities of 7,8-dialkyl-1,3-diaminopyrrolo[3,2-f]quinazolines with small molecular size. J Med Chem39:892-903 (1996) 
 
Dihydrofolate reductase
Name:Dihydrofolate reductase
Type:Enzyme
Mol. Mass.:21453.99
Organism:Homo sapiens (Human)
Description:Recombinant human DHFR.
Residue:187
BDBM18268
NameBDBM18268
Synonyms:5-methyl-6-{[(3,4,5-trimethoxyphenyl)amino]methyl}quinazoline-2,4-diamine TMQ US11111252, Compound TMQ | US11530198, Example Trimetrexate
TypeSmall organic molecule
Emp. Form.C19H23N5O3
Mol. Mass.369.4176
SMILESCOc1cc(NCc2ccc3nc(N)nc(N)c3c2C)cc(OC)c1OC