Reaction Details
TargetHistone-lysine N-methyltransferase SMYD3
LigandBDBM378462
Substrate/Competitorn/a
Meas. Tech.ChEMBL_1576462 (CHEMBL3803390)
Ki 1.1±n/a nM
Citation Mitchell, LHBoriack-Sjodin, PASmith, SThomenius, MRioux, NMunchhof, MMills, JEKlaus, CTotman, JRiera, TVRaimondi, AJacques, SLWest, KFoley, MWaters, NJKuntz, KWWigle, TJScott, MPCopeland, RASmith, JJChesworth, R Novel Oxindole Sulfonamides and Sulfamides: EPZ031686, the First Orally Bioavailable Small Molecule SMYD3 Inhibitor. ACS Med Chem Lett7:134-8 (2016) 
 
Histone-lysine N-methyltransferase SMYD3
Name:Histone-lysine N-methyltransferase SMYD3
Type:Enzyme
Mol. Mass.:49101.22
Organism:Homo sapiens (Human)
Description:Q9H7B4-2
Residue:428
BDBM378462
NameBDBM378462
Synonyms:6-chloro-2-oxo-N-((1R,3r,5S)-8-(((1-(4,4,4-trifluorobutyl)piperidin-4-yl)methyl)sulfonyl)-8-azabicyclo[3.2.1]octan-3-yl)indoline-5-carboxamide | US10266526, Compound 595
TypeSmall organic molecule
Emp. Form.C26H34ClF3N4O4S
Mol. Mass.591.086
SMILESFC(F)(F)CCCN1CCC(CS(=O)(=O)N2[C@H]3CC[C@@H]2C[C@@H](C3)NC(=O)c2cc3CC(=O)Nc3cc2Cl)CC1