Reaction Details
TargetDihydrofolate reductase
LigandBDBM50051746
Substrate/Competitorn/a
Meas. Tech.ChEMBL_54120 (CHEMBL668278)
IC50 1.3±n/a nM
Citation Tsukamoto, THaile, WHMcGuire, JJCoward, JK Synthesis and biological evaluation of N alpha-(4-amino-4-deoxy-10-methylpteroyl)-DL-4,4-difluoroornithine. J Med Chem39:2536-40 (1996) 
 
Dihydrofolate reductase
Name:Dihydrofolate reductase
Type:Enzyme
Mol. Mass.:21453.99
Organism:Homo sapiens (Human)
Description:Recombinant human DHFR.
Residue:187
BDBM50051746
NameBDBM50051746
Synonyms:5-Amino-2-{4-[(2,4-diamino-pteridin-6-ylmethyl)-methyl-amino]-benzoylamino}-4,4-difluoro-pentanoic acid | CHEMBL83644
TypeSmall organic molecule
Emp. Form.C20H23F2N9O3
Mol. Mass.475.4519
SMILESCN(Cc1cnc2nc(N)nc(N)c2n1)c1ccc(cc1)C(=O)NC(CC(F)(F)CN)C(O)=O