Reaction Details
TargetTyrosine-protein kinase ITK/TSK
LigandBDBM209866
Substrate/Competitorn/a
Meas. Tech.ChEMBL_1656292 (CHEMBL4005762)
Ki 27±n/a nM
Citation Thorarensen, ADowty, MEBanker, MEJuba, BJussif, JLin, TVincent, FCzerwinski, RMCasimiro-Garcia, AUnwalla, RTrujillo, JILiang, SBalbo, PChe, YGilbert, AMBrown, MFHayward, MMontgomery, JLeung, LYang, XSoucy, SHegen, MCoe, JLangille, JVajdos, FChrencik, JTelliez, JB Design of a Janus Kinase 3 (JAK3) Specific Inhibitor 1-((2S,5R)-5-((7H-Pyrrolo[2,3-d]pyrimidin-4-yl)amino)-2-methylpiperidin-1-yl)prop-2-en-1-one (PF-06651600) Allowing for the Interrogation of JAK3 Signaling in Humans. J Med Chem60:1971-1993 (2017) 
 
Tyrosine-protein kinase ITK/TSK
Name:Tyrosine-protein kinase ITK/TSK
Type:Protein
Mol. Mass.:71839.20
Organism:Homo sapiens (Human)
Description:Q08881
Residue:620
BDBM209866
NameBDBM209866
Synonyms:PF-06651600 US20230348487, Example PF-06651600 | US9617258, Example 5
TypeSmall organic molecule
Emp. Form.C15H19N5O
Mol. Mass.285.3443
SMILESC[C@H]1CC[C@H](CN1C(=O)C=C)Nc1ncnc2[nH]ccc12