Reaction Details
TargetVasopressin V1a receptor
LigandBDBM50052909
Substrate/Competitorn/a
Meas. Tech.ChEMBL_214553 (CHEMBL820170)
IC50 45±n/a nM
Citation Ogawa, HYamashita, HKondo, KYamamura, YMiyamoto, HKan, KKitano, KTanaka, MNakaya, KNakamura, SMori, TTominaga, MYabuuchi, Y Orally active, nonpeptide vasopressin V2 receptor antagonists: a novel series of 1-[4-(benzoylamino)benzoyl]-2,3,4,5-tetrahydro-1H-benzazepines and related compounds. J Med Chem39:3547-55 (1996) 
 
Vasopressin V1a receptor
Name:Vasopressin V1a receptor
Type:Enzyme Catalytic Domain
Mol. Mass.:47674.81
Organism:RAT
Description:VASOPRESSIN V1A AVPR1A RAT::P30560
Residue:424
BDBM50052909
NameBDBM50052909
Synonyms:2-Chloro-N-[4-(2,3,4,5-tetrahydro-benzo[b]azepine-1-carbonyl)-phenyl]-benzamide | CHEMBL118387
TypeSmall organic molecule
Emp. Form.C24H21ClN2O2
Mol. Mass.404.889
SMILESClc1ccccc1C(=O)Nc1ccc(cc1)C(=O)N1CCCCc2ccccc12