Reaction Details
TargetPhospholipase A2, membrane associated
LigandBDBM50055391
Substrate/Competitorn/a
Meas. Tech.ChEMBL_156189 (CHEMBL761440)
IC50 11±n/a nM
Citation Draheim, SEBach, NJDillard, RDBerry, DRCarlson, DGChirgadze, NYClawson, DKHartley, LWJohnson, LMJones, NDMcKinney, ERMihelich, EDOlkowski, JLSchevitz, RWSmith, ACSnyder, DWSommers, CDWery, JP Indole inhibitors of human nonpancreatic secretory phospholipase A2. 3. Indole-3-glyoxamides. J Med Chem39:5159-75 (1997) 
 
Phospholipase A2, membrane associated
Name:Phospholipase A2, membrane associated
Type:Hydrolase
Mol. Mass.:16101.20
Organism:Homo sapiens (Human)
Description:The human nps PLA2 was cloned, and expressed in E. coli. There was a refolding process in the purification.
Residue:144
BDBM50055391
NameBDBM50055391
Synonyms:2-(3-(2-amino-2-oxoacetyl)-1-benzyl-2-ethyl-1H-indol-4-yloxy)propanoic acid CHEMBL148649
TypeSmall organic molecule
Emp. Form.C22H22N2O5
Mol. Mass.394.4205
SMILESCCc1c(C(=O)C(N)=O)c2c(OC(C)C(O)=O)cccc2n1Cc1ccccc1