Reaction Details
TargetPhospholipase A2, membrane associated
LigandBDBM50055380
Substrate/Competitorn/a
Meas. Tech.ChEMBL_156188 (CHEMBL761439)
IC50 8±n/a nM
Citation Draheim, SEBach, NJDillard, RDBerry, DRCarlson, DGChirgadze, NYClawson, DKHartley, LWJohnson, LMJones, NDMcKinney, ERMihelich, EDOlkowski, JLSchevitz, RWSmith, ACSnyder, DWSommers, CDWery, JP Indole inhibitors of human nonpancreatic secretory phospholipase A2. 3. Indole-3-glyoxamides. J Med Chem39:5159-75 (1997) 
 
Phospholipase A2, membrane associated
Name:Phospholipase A2, membrane associated
Type:Hydrolase
Mol. Mass.:16101.20
Organism:Homo sapiens (Human)
Description:The human nps PLA2 was cloned, and expressed in E. coli. There was a refolding process in the purification.
Residue:144
BDBM50055380
NameBDBM50055380
Synonyms:(3-Aminooxalyl-1-benzyl-2-ethyl-6-methyl-1H-indol-4-yl)-acetic acid | CHEMBL347748
TypeSmall organic molecule
Emp. Form.C22H22N2O4
Mol. Mass.378.4211
SMILESCCc1c(C(=O)C(N)=O)c2c(CC(O)=O)cc(C)cc2n1Cc1ccccc1