Reaction Details
TargetPhospholipase A2, major isoenzyme
LigandBDBM50055367
Substrate/Competitorn/a
Meas. Tech.ChEMBL_156355 (CHEMBL761685)
IC50 3±n/a nM
Citation Draheim, SEBach, NJDillard, RDBerry, DRCarlson, DGChirgadze, NYClawson, DKHartley, LWJohnson, LMJones, NDMcKinney, ERMihelich, EDOlkowski, JLSchevitz, RWSmith, ACSnyder, DWSommers, CDWery, JP Indole inhibitors of human nonpancreatic secretory phospholipase A2. 3. Indole-3-glyoxamides. J Med Chem39:5159-75 (1997) 
 
Phospholipase A2, major isoenzyme
Name:Phospholipase A2, major isoenzyme
Type:Hydrolase; monomer or homodimer
Mol. Mass.:16279.83
Organism:Sus scrofa (pig)
Description:Purchased from Sigma.
Residue:146
BDBM50055367
NameBDBM50055367
Synonyms:CHEMBL345986 | [3-Aminooxalyl-1-(3-chloro-benzyl)-2-ethyl-1H-indol-4-yloxy]-acetic acid
TypeSmall organic molecule
Emp. Form.C21H19ClN2O5
Mol. Mass.414.839
SMILESCCc1c(C(=O)C(N)=O)c2c(OCC(O)=O)cccc2n1Cc1cccc(Cl)c1