Reaction Details
TargetReverse transcriptase/RNaseH
LigandBDBM50055475
Substrate/Competitorn/a
Meas. Tech.ChEMBL_195079 (CHEMBL797533)
IC50 2200±n/a nM
Citation Genin, MJPoel, TJYagi, YBiles, CAlthaus, IKeiser, BJKopta, LAFriis, JMReusser, FAdams, WJOlmsted, RAVoorman, RLThomas, RCRomero, DL Synthesis and bioactivity of novel bis(heteroaryl)piperazine (BHAP) reverse transcriptase inhibitors: structure-activity relationships and increased metabolic stability of novel substituted pyridine analogs. J Med Chem39:5267-75 (1997) 
 
Reverse transcriptase/RNaseH
Name:Reverse transcriptase/RNaseH
Type:PROTEIN
Mol. Mass.:65229.15
Organism:Human immunodeficiency virus 1
Description:ChEMBL_1473730
Residue:566
BDBM50055475
NameBDBM50055475
Synonyms:CHEMBL424141 | {4-[(3-Ethylamino-pyridin-2-yl)-methyl-amino]-piperidin-1-yl}-(1H-indol-2-yl)-methanone
TypeSmall organic molecule
Emp. Form.C22H27N5O
Mol. Mass.377.4827
SMILESCCNc1cccnc1N(C)C1CCN(CC1)C(=O)c1cc2ccccc2[nH]1