Reaction Details
TargetReverse transcriptase/RNaseH
LigandBDBM50055478
Substrate/Competitorn/a
Meas. Tech.ChEMBL_195079 (CHEMBL797533)
IC50 1800±n/a nM
Citation Genin, MJPoel, TJYagi, YBiles, CAlthaus, IKeiser, BJKopta, LAFriis, JMReusser, FAdams, WJOlmsted, RAVoorman, RLThomas, RCRomero, DL Synthesis and bioactivity of novel bis(heteroaryl)piperazine (BHAP) reverse transcriptase inhibitors: structure-activity relationships and increased metabolic stability of novel substituted pyridine analogs. J Med Chem39:5267-75 (1997) 
 
Reverse transcriptase/RNaseH
Name:Reverse transcriptase/RNaseH
Type:PROTEIN
Mol. Mass.:65229.15
Organism:Human immunodeficiency virus 1
Description:ChEMBL_1473730
Residue:566
BDBM50055478
NameBDBM50055478
Synonyms:(1H-Indol-2-yl)-[4-(3-isopropoxy-pyridin-2-yl)-piperazin-1-yl]-methanone | CHEMBL356163
TypeSmall organic molecule
Emp. Form.C21H24N4O2
Mol. Mass.364.4409
SMILESCC(C)Oc1cccnc1N1CCN(CC1)C(=O)c1cc2ccccc2[nH]1