Reaction Details
TargetProstaglandin G/H synthase 1
LigandBDBM50057532
Substrate/Competitorn/a
Meas. Tech.ChEMBL_158753 (CHEMBL772766)
IC50 18±n/a nM
Citation Penning, TDTalley, JJBertenshaw, SRCarter, JSCollins, PWDocter, SGraneto, MJLee, LFMalecha, JWMiyashiro, JMRogers, RSRogier, DJYu, SSAndersonGD, naBurton, EGCogburn, JNGregory, SAKoboldt, CMPerkins, WESeibert, KVeenhuizen, AWZhang, YYIsakson, PC Synthesis and biological evaluation of the 1,5-diarylpyrazole class of cyclooxygenase-2 inhibitors: identification of 4-[5-(4-methylphenyl)-3-(trifluoromethyl)-1H-pyrazol-1-yl]benze nesulfonamide (SC-58635, celecoxib). J Med Chem40:1347-65 (1997) 
 
Prostaglandin G/H synthase 1
Name:Prostaglandin G/H synthase 1
Type:Enzyme
Mol. Mass.:68692.62
Organism:Homo sapiens (Human)
Description:P23219
Residue:599
BDBM50057532
NameBDBM50057532
Synonyms:1-(4-Chloro-phenyl)-5-(4-methoxy-phenyl)-3-trifluoromethyl-1H-pyrazole | CHEMBL30011
TypeSmall organic molecule
Emp. Form.C17H12ClF3N2O
Mol. Mass.352.738
SMILESCOc1ccc(cc1)-c1cc(nn1-c1ccc(Cl)cc1)C(F)(F)F