Reaction Details
TargetProstaglandin G/H synthase 2
LigandBDBM50057552
Substrate/Competitorn/a
Meas. Tech.ChEMBL_159768 (CHEMBL763093)
IC50 12±n/a nM
Citation Penning, TDTalley, JJBertenshaw, SRCarter, JSCollins, PWDocter, SGraneto, MJLee, LFMalecha, JWMiyashiro, JMRogers, RSRogier, DJYu, SSAndersonGD, naBurton, EGCogburn, JNGregory, SAKoboldt, CMPerkins, WESeibert, KVeenhuizen, AWZhang, YYIsakson, PC Synthesis and biological evaluation of the 1,5-diarylpyrazole class of cyclooxygenase-2 inhibitors: identification of 4-[5-(4-methylphenyl)-3-(trifluoromethyl)-1H-pyrazol-1-yl]benze nesulfonamide (SC-58635, celecoxib). J Med Chem40:1347-65 (1997) 
 
Prostaglandin G/H synthase 2
Name:Prostaglandin G/H synthase 2
Type:Enzyme
Mol. Mass.:69003.89
Organism:Homo sapiens (Human)
Description:Recombinant Cox-2 provided by Cayman (Cayman Chemical Co.,Ann Arbor, MI).
Residue:604
BDBM50057552
NameBDBM50057552
Synonyms:4-[5-(5-Bromo-thiophen-2-yl)-3-trifluoromethyl-pyrazol-1-yl]-benzenesulfonamide | CHEMBL29472
TypeSmall organic molecule
Emp. Form.C14H9BrF3N3O2S2
Mol. Mass.452.269
SMILESNS(=O)(=O)c1ccc(cc1)-n1nc(cc1-c1ccc(Br)s1)C(F)(F)F