Reaction Details
TargetSigma non-opioid intracellular receptor 1
LigandBDBM50507208
Substrate/Competitorn/a
Meas. Tech.ChEMBL_1829443 (CHEMBL4329317)
Ki 5.7±n/a nM
Citation Lalut, JSantoni, GKarila, DLecoutey, CDavis, ANachon, FSilman, ISussman, JWeik, MMaurice, TDallemagne, PRochais, C Novel multitarget-directed ligands targeting acetylcholinesterase and ? Eur J Med Chem162:234-248 (2019) 
 
Sigma non-opioid intracellular receptor 1
Name:Sigma non-opioid intracellular receptor 1
Type:Enzyme Catalytic Domain
Mol. Mass.:25124.85
Organism:Homo sapiens (Human)
Description:Q99720
Residue:223
BDBM50507208
NameBDBM50507208
Synonyms:CHEMBL4526050
TypeSmall organic molecule
Emp. Form.C24H27ClN2O2
Mol. Mass.410.936
SMILESCOc1c(cc(Cl)c2[nH]ccc12)C(=O)CCC1CCN(Cc2ccccc2)CC1