Reaction Details
TargetSigma non-opioid intracellular receptor 1
LigandBDBM50507212
Substrate/Competitorn/a
Meas. Tech.ChEMBL_1829443 (CHEMBL4329317)
Ki 3.3±n/a nM
Citation Lalut, JSantoni, GKarila, DLecoutey, CDavis, ANachon, FSilman, ISussman, JWeik, MMaurice, TDallemagne, PRochais, C Novel multitarget-directed ligands targeting acetylcholinesterase and ? Eur J Med Chem162:234-248 (2019) 
 
Sigma non-opioid intracellular receptor 1
Name:Sigma non-opioid intracellular receptor 1
Type:Enzyme Catalytic Domain
Mol. Mass.:25124.85
Organism:Homo sapiens (Human)
Description:Q99720
Residue:223
BDBM50507212
NameBDBM50507212
Synonyms:CHEMBL4585990
TypeSmall organic molecule
Emp. Form.C23H26N2O
Mol. Mass.346.4653
SMILESO=C(CCC1CCN(Cc2ccccc2)CC1)c1ccc2[nH]ccc2c1