Reaction Details
Target5-hydroxytryptamine receptor 4
LigandBDBM50079362
Substrate/Competitorn/a
Meas. Tech.ChEMBL_1829440 (CHEMBL4329314)
Ki 9.5±n/a nM
Citation Lalut, JSantoni, GKarila, DLecoutey, CDavis, ANachon, FSilman, ISussman, JWeik, MMaurice, TDallemagne, PRochais, C Novel multitarget-directed ligands targeting acetylcholinesterase and ? Eur J Med Chem162:234-248 (2019) 
 
5-hydroxytryptamine receptor 4
Name:5-hydroxytryptamine receptor 4
Type:Enzyme
Mol. Mass.:43767.54
Organism:Homo sapiens (Human)
Description:Q13639
Residue:388
BDBM50079362
NameBDBM50079362
Synonyms:CHEMBL3417009 | US9663465, 9
TypeSmall organic molecule
Emp. Form.C22H33ClN2O2
Mol. Mass.392.963
SMILESCOc1cc(N)c(Cl)cc1C(=O)CCC1CCN(CC2CCCCC2)CC1