Reaction Details
TargetSigma non-opioid intracellular receptor 1
LigandBDBM50507209
Substrate/Competitorn/a
Meas. Tech.ChEMBL_1829443 (CHEMBL4329317)
Ki 5.1±n/a nM
Citation Lalut, JSantoni, GKarila, DLecoutey, CDavis, ANachon, FSilman, ISussman, JWeik, MMaurice, TDallemagne, PRochais, C Novel multitarget-directed ligands targeting acetylcholinesterase and ? Eur J Med Chem162:234-248 (2019) 
 
Sigma non-opioid intracellular receptor 1
Name:Sigma non-opioid intracellular receptor 1
Type:Enzyme Catalytic Domain
Mol. Mass.:25124.85
Organism:Homo sapiens (Human)
Description:Q99720
Residue:223
BDBM50507209
NameBDBM50507209
Synonyms:CHEMBL4537101
TypeSmall organic molecule
Emp. Form.C24H33ClN2O2
Mol. Mass.416.984
SMILESCOc1c(cc(Cl)c2[nH]ccc12)C(=O)CCC1CCN(CC2CCCCC2)CC1