Reaction Details
Target11-beta-hydroxysteroid dehydrogenase 1
LigandBDBM50507376
Substrate/Competitorn/a
Meas. Tech.ChEMBL_1829814 (CHEMBL4329688)
IC50 0.500000±n/a nM
Citation Li, JKennedy, LJWalker, SJWang, HLi, JJHong, ZO'Connor, SPYe, XYChen, SWu, SYoon, DSNayeem, ACamac, DMRamamurthy, VMorin, PESheriff, SWang, MHarper, TWGolla, RSeethala, RHarrity, TPonticiello, RPMorgan, NNTaylor, JRZebo, RMaxwell, BMoulin, FGordon, DARobl, JA Discovery of Clinical Candidate BMS-823778 as an Inhibitor of Human 11?-Hydroxysteroid Dehydrogenase Type 1 (11?-HSD-1). ACS Med Chem Lett9:1170-1174 (2018) 
 
11-beta-hydroxysteroid dehydrogenase 1
Name:11-beta-hydroxysteroid dehydrogenase 1
Type:Enzyme
Mol. Mass.:32409.16
Organism:Homo sapiens (Human)
Description:P28845
Residue:292
BDBM50507376
NameBDBM50507376
Synonyms:CHEMBL4453347
TypeSmall organic molecule
Emp. Form.C20H22ClN3O
Mol. Mass.355.861
SMILESCC(C)(CCO)c1cccn2c(nnc12)C1(CC1)c1ccc(Cl)cc1