Reaction Details
Target5-hydroxytryptamine receptor 2C
LigandBDBM50059890
Substrate/Competitorn/a
Meas. Tech.ChEMBL_2803 (CHEMBL617655)
EC50 1000±n/a nM
Citation Monte, APWaldman, SRMarona-Lewicka, DWainscott, DBNelson, DLSanders-Bush, ENichols, DE Dihydrobenzofuran analogues of hallucinogens. 4. Mescaline derivatives. J Med Chem40:2997-3008 (1997) 
 
5-hydroxytryptamine receptor 2C
Name:5-hydroxytryptamine receptor 2C
Type:Enzyme
Mol. Mass.:51935.10
Organism:Rattus norvegicus (Rat)
Description:P08909
Residue:460
BDBM50059890
NameBDBM50059890
Synonyms:2-(8-Methoxy-2,3,5,6-tetrahydro-benzo[1,2-b;5,4-b']difuran-4-yl)-ethylamine | CHEMBL316527
TypeSmall organic molecule
Emp. Form.C13H17NO3
Mol. Mass.235.279
SMILESCOc1c2OCCc2c(CCN)c2CCOc12