Reaction Details
TargetBromodomain and WD repeat-containing protein 1
LigandBDBM249277
Substrate/Competitorn/a
Meas. Tech.ChEMBL_1832543 (CHEMBL4332551)
Kd>10000±n/a nM
Citation Sperandio, DAktoudianakis, VBabaoglu, KChen, XElbel, KChin, GCorkey, BDu, JJiang, BKobayashi, TMackman, RMartinez, RYang, HZablocki, JKusam, SJordan, KWebb, HBates, JGLad, LMish, MNiedziela-Majka, AMetobo, SSapre, AHung, MJin, DFung, WKan, EEisenberg, GLarson, NNewby, ZERLansdon, ETay, CNeve, RMShevick, SLBreckenridge, DG Structure-guided discovery of a novel, potent, and orally bioavailable 3,5-dimethylisoxazole aryl-benzimidazole BET bromodomain inhibitor. Bioorg Med Chem27:457-469 (2019) 
 
Bromodomain and WD repeat-containing protein 1
Name:Bromodomain and WD repeat-containing protein 1
Type:PROTEIN
Mol. Mass.:262994.15
Organism:Homo sapiens (Human)
Description:ChEMBL_109516
Residue:2320
BDBM249277
NameBDBM249277
Synonyms:US10017501, Compound 1020-18 | US9458145, 1020-18
TypeSmall organic molecule
Emp. Form.C25H22N4O
Mol. Mass.394.4684
SMILESCc1noc(C)c1-c1cc(-c2c(C)ccc3ncccc23)c2[nH]c(nc2c1)C1CC1