Reaction Details
TargetGenome polyprotein
LigandBDBM50061551
Substrate/Competitorn/a
Meas. Tech.ChEMBL_158975 (CHEMBL763742)
IC50 1000±n/a nM
Citation Ogilvie, WBailey, MPoupart, MAAbraham, ABhavsar, ABonneau, PBordeleau, JBousquet, YChabot, CDuceppe, JSFazal, GGoulet, SGrand-Maître, CGuse, IHalmos, TLavallée, PLeach, MMalenfant, EO'Meara, JPlante, RPlouffe, CPoirier, MSoucy, FYoakim, CDéziel, R Peptidomimetic inhibitors of the human cytomegalovirus protease. J Med Chem40:4113-35 (1998) 
 
Genome polyprotein
Name:Genome polyprotein
Type:PROTEIN
Mol. Mass.:44361.04
Organism:Human rhinovirus B
Description:ChEMBL_158953
Residue:401
BDBM50061551
NameBDBM50061551
Synonyms:(S)-2-{(S)-2-[3-(4-Hydroxy-phenyl)-propionylamino]-3,3-dimethyl-butyrylamino}-N*4*,N*4*-dimethyl-N*1*-(3,3,3-trifluoro-1-methyl-2-oxo-propyl)-succinamide | CHEMBL132421
TypeSmall organic molecule
Emp. Form.C25H35F3N4O6
Mol. Mass.544.5638
SMILESCC(NC(=O)[C@H](CC(=O)N(C)C)NC(=O)[C@@H](NC(=O)CCc1ccc(O)cc1)C(C)(C)C)C(=O)C(F)(F)F