Reaction Details
TargetGenome polyprotein
LigandBDBM50061512
Substrate/Competitorn/a
Meas. Tech.ChEMBL_158975 (CHEMBL763742)
IC50 600±n/a nM
Citation Ogilvie, WBailey, MPoupart, MAAbraham, ABhavsar, ABonneau, PBordeleau, JBousquet, YChabot, CDuceppe, JSFazal, GGoulet, SGrand-Maître, CGuse, IHalmos, TLavallée, PLeach, MMalenfant, EO'Meara, JPlante, RPlouffe, CPoirier, MSoucy, FYoakim, CDéziel, R Peptidomimetic inhibitors of the human cytomegalovirus protease. J Med Chem40:4113-35 (1998) 
 
Genome polyprotein
Name:Genome polyprotein
Type:PROTEIN
Mol. Mass.:44361.04
Organism:Human rhinovirus B
Description:ChEMBL_158953
Residue:401
BDBM50061512
NameBDBM50061512
Synonyms:(S)-N*1*-(2-Benzooxazol-2-yl-1-methyl-2-oxo-ethyl)-2-[(S)-2-(3,3-dimethyl-butyrylamino)-3,3-dimethyl-butyrylamino]-N*4*,N*4*-dimethyl-succinamide CHEMBL131909
TypeSmall organic molecule
Emp. Form.C28H41N5O6
Mol. Mass.543.655
SMILESCC(NC(=O)[C@H](CC(=O)N(C)C)NC(=O)[C@@H](NC(=O)CC(C)(C)C)C(C)(C)C)C(=O)c1nc2ccccc2o1