Reaction Details
TargetReverse transcriptase/RNaseH
LigandBDBM17666
Substrate/Competitorn/a
Meas. Tech.ChEMBL_197262 (CHEMBL804178)
EC50 1850±n/a nM
Citation Roth, TMorningstar, MLBoyer, PLHughes, SHBuckheit, RWMichejda, CJ Synthesis and biological activity of novel nonnucleoside inhibitors of HIV-1 reverse transcriptase. 2-Aryl-substituted benzimidazoles. J Med Chem40:4199-207 (1998) 
 
Reverse transcriptase/RNaseH
Name:Reverse transcriptase/RNaseH
Type:PROTEIN
Mol. Mass.:65229.15
Organism:Human immunodeficiency virus 1
Description:ChEMBL_1473730
Residue:566
BDBM17666
NameBDBM17666
Synonyms:2-(2,6-difluorophenyl)-1-[(2,6-difluorophenyl)methyl]-1H-1,3-benzodiazole benzimidazole analogue, 2
TypeSmall organic molecule
Emp. Form.C20H12F4N2
Mol. Mass.356.3163
SMILESFc1cccc(F)c1Cn1c(nc2ccccc12)-c1c(F)cccc1F