Reaction Details
TargetReverse transcriptase/RNaseH
LigandBDBM17665
Substrate/Competitorn/a
Meas. Tech.ChEMBL_79633 (CHEMBL695507)
EC50 16700±n/a nM
Citation Roth, TMorningstar, MLBoyer, PLHughes, SHBuckheit, RWMichejda, CJ Synthesis and biological activity of novel nonnucleoside inhibitors of HIV-1 reverse transcriptase. 2-Aryl-substituted benzimidazoles. J Med Chem40:4199-207 (1998) 
 
Reverse transcriptase/RNaseH
Name:Reverse transcriptase/RNaseH
Type:PROTEIN
Mol. Mass.:65229.15
Organism:Human immunodeficiency virus 1
Description:ChEMBL_1473730
Residue:566
BDBM17665
NameBDBM17665
Synonyms:2-(2,6-difluorophenyl)-1-[(2,6-difluorophenyl)methyl]-4-methyl-1H-1,3-benzodiazole benzimidazole analogue, 1
TypeSmall organic molecule
Emp. Form.C21H14F4N2
Mol. Mass.370.3429
SMILESCc1cccc2n(Cc3c(F)cccc3F)c(nc12)-c1c(F)cccc1F