Reaction Details
TargetMuscarinic acetylcholine receptor M1
LigandBDBM50062595
Substrate/Competitorn/a
Meas. Tech.ChEMBL_138689 (CHEMBL747656)
IC50 0.600±n/a nM
Citation Ward, JSMerritt, LCalligaro, DOBymaster, FPShannon, HEMitch, CHWhitesitt, CBrunsting, DSheardown, MJOlesen, PHSwedberg, MDJeppesen, LSauerberg, P 1,2,5-Thiadiazole analogues of aceclidine as potent m1 muscarinic agonists. J Med Chem41:379-92 (1998) 
 
Muscarinic acetylcholine receptor M1
Name:Muscarinic acetylcholine receptor M1
Type:Enzyme Catalytic Domain
Mol. Mass.:51390.46
Organism:RAT
Description:P08482
Residue:460
BDBM50062595
NameBDBM50062595
Synonyms:3-(4-Propylsulfanyl-[1,2,5]thiadiazol-3-yl)-1-aza-bicyclo[2.2.1]heptane | CHEMBL129821
TypeSmall organic molecule
Emp. Form.C11H17N3S2
Mol. Mass.255.403
SMILESCCCSc1nsnc1C1CN2CCC1C2