Reaction Details
TargetIsocitrate dehydrogenase [NADP] cytoplasmic
LigandBDBM279884
Substrate/Competitorn/a
Meas. Tech.ChEMBL_1838752 (CHEMBL4338885)
IC50 1.000000±n/a nM
Citation Konteatis, ZArtin, ENicolay, BStraley, KPadyana, AKJin, LChen, YNarayaraswamy, RTong, SWang, FZhou, DCui, DCai, ZLuo, ZFang, CTang, HLv, XNagaraja, RYang, HSu, SMSui, ZDang, LYen, KPopovici-Muller, JCodega, PCampos, CMellinghoff, IKBiller, SA Vorasidenib (AG-881): A First-in-Class, Brain-Penetrant Dual Inhibitor of Mutant IDH1 and 2 for Treatment of Glioma. ACS Med Chem Lett11:101-107 (2020) 
 
Isocitrate dehydrogenase [NADP] cytoplasmic
Name:Isocitrate dehydrogenase [NADP] cytoplasmic
Type:Protein
Mol. Mass.:46661.29
Organism:Homo sapiens (Human)
Description:O75874
Residue:414
BDBM279884
NameBDBM279884
Synonyms:US10028961, Compound 31 US10946023, Compound 31
TypeSmall organic molecule
Emp. Form.C19H19F7N6
Mol. Mass.464.3832
SMILESFC(F)(F)c1cccc(n1)-c1nc(NC2CCC(F)(F)C2)nc(NC2CCC(F)(F)C2)n1