Reaction Details
TargetIsocitrate dehydrogenase [NADP], mitochondrial
LigandBDBM279884
Substrate/Competitorn/a
Meas. Tech.ChEMBL_1838753 (CHEMBL4338886)
IC50 9.0±n/a nM
Citation Konteatis, ZArtin, ENicolay, BStraley, KPadyana, AKJin, LChen, YNarayaraswamy, RTong, SWang, FZhou, DCui, DCai, ZLuo, ZFang, CTang, HLv, XNagaraja, RYang, HSu, SMSui, ZDang, LYen, KPopovici-Muller, JCodega, PCampos, CMellinghoff, IKBiller, SA Vorasidenib (AG-881): A First-in-Class, Brain-Penetrant Dual Inhibitor of Mutant IDH1 and 2 for Treatment of Glioma. ACS Med Chem Lett11:101-107 (2020) 
 
Isocitrate dehydrogenase [NADP], mitochondrial
Name:Isocitrate dehydrogenase [NADP], mitochondrial
Type:Protein
Mol. Mass.:50923.31
Organism:Homo sapiens (Human)
Description:Full-length wild-type
Residue:452
BDBM279884
NameBDBM279884
Synonyms:US10028961, Compound 31 US10946023, Compound 31
TypeSmall organic molecule
Emp. Form.C19H19F7N6
Mol. Mass.464.3832
SMILESFC(F)(F)c1cccc(n1)-c1nc(NC2CCC(F)(F)C2)nc(NC2CCC(F)(F)C2)n1