Reaction Details
TargetSomatostatin receptor type 3
LigandBDBM50064027
Substrate/Competitorn/a
Meas. Tech.ChEMBL_200505 (CHEMBL803850)
Ki 900±n/a nM
Citation Hirschmann, RHynes, JCichy-Knight, MAvan Rijn, RDSprengeler, PASpoors, PGShakespeare, WCPietranico-Cole, SBarbosa, JLiu, JYao, WRohrer, SSmith, AB Modulation of receptor and receptor subtype affinities using diastereomeric and enantiomeric monosaccharide scaffolds as a means to structural and biological diversity. A new route to ether synthesis. J Med Chem41:1382-91 (1998) 
 
Somatostatin receptor type 3
Name:Somatostatin receptor type 3
Type:Protein
Mol. Mass.:45855.97
Organism:Homo sapiens (Human)
Description:P32745
Residue:418
BDBM50064027
NameBDBM50064027
Synonyms:5-{(2S,3S,4R,5R,6S)-3,4-Bis-benzyloxy-5-(1H-imidazol-4-ylmethoxy)-6-[2-(1H-indol-3-yl)-ethoxy]-tetrahydro-pyran-2-ylmethoxy}-pentylamine | CHEMBL285333
TypeSmall organic molecule
Emp. Form.C39H48N4O6
Mol. Mass.668.8216
SMILESNCCCCCOC[C@@H]1O[C@H](OCCc2c[nH]c3ccccc23)[C@H](OCc2cnc[nH]2)[C@H](OCc2ccccc2)[C@H]1OCc1ccccc1