Reaction Details
TargetSomatostatin receptor type 1
LigandBDBM50064025
Substrate/Competitorn/a
Meas. Tech.ChEMBL_200358 (CHEMBL807425)
Ki 2100±n/a nM
Citation Hirschmann, RHynes, JCichy-Knight, MAvan Rijn, RDSprengeler, PASpoors, PGShakespeare, WCPietranico-Cole, SBarbosa, JLiu, JYao, WRohrer, SSmith, AB Modulation of receptor and receptor subtype affinities using diastereomeric and enantiomeric monosaccharide scaffolds as a means to structural and biological diversity. A new route to ether synthesis. J Med Chem41:1382-91 (1998) 
 
Somatostatin receptor type 1
Name:Somatostatin receptor type 1
Type:Enzyme
Mol. Mass.:42692.81
Organism:Homo sapiens (Human)
Description:P30872
Residue:391
BDBM50064025
NameBDBM50064025
Synonyms:CHEMBL282129 | N*1*-{(2R,3R,4S,5R,6R)-3,4,5-Tris-benzyloxy-6-[2-(1H-indol-3-yl)-ethoxy]-tetrahydro-pyran-2-ylmethyl}-pentane-1,5-diamine
TypeSmall organic molecule
Emp. Form.C42H51N3O5
Mol. Mass.677.8714
SMILESNCCCCCNC[C@H]1O[C@@H](OCCc2c[nH]c3ccccc23)[C@H](OCc2ccccc2)[C@@H](OCc2ccccc2)[C@@H]1OCc1ccccc1