Reaction Details
TargetBeta-2 adrenergic receptor
LigandBDBM50510102
Substrate/Competitorn/a
Meas. Tech.ChEMBL_1840282 (CHEMBL4340581)
EC50 0.020893±n/a nM
Citation Xing, GPan, LYi, CLi, XGe, XZhao, YLiu, YLi, JWoo, ALin, BZhang, YCheng, M Design, synthesis and biological evaluation of 5-(2-amino-1-hydroxyethyl)-8-hydroxyquinolin-2(1H)-one derivatives as potent ? Bioorg Med Chem27:2306-2314 (2019) 
 
Beta-2 adrenergic receptor
Name:Beta-2 adrenergic receptor
Type:n/a
Mol. Mass.:46461.69
Organism:Homo sapiens (Human)
Description:P07550
Residue:413
BDBM50510102
NameBDBM50510102
Synonyms:CHEMBL4445289
TypeSmall organic molecule
Emp. Form.C22H26N2O3
Mol. Mass.366.4534
SMILESCC(C)(CCc1ccccc1)NC[C@H](O)c1ccc(O)c2[nH]c(=O)ccc12