Reaction Details
TargetDelta-type opioid receptor
LigandBDBM50064515
Substrate/Competitorn/a
Meas. Tech.ChEMBL_147291 (CHEMBL755878)
Ki 0.355000±n/a nM
Citation Thomas, JBMascarella, SWRothman, RBPartilla, JSXu, HMcCullough, KBDersch, CMCantrell, BEZimmerman, DMCarroll, FI Investigation of the N-substituent conformation governing potency and mu receptor subtype-selectivity in (+)-(3R, 4R)-dimethyl-4-(3-hydroxyphenyl)piperidine opioid antagonists. J Med Chem41:1980-90 (1998) 
 
Delta-type opioid receptor
Name:Delta-type opioid receptor
Type:G Protein-Coupled Receptor (GPCR)
Mol. Mass.:40382.98
Organism:Homo sapiens (Human)
Description:Competition binding assays were carried out using membrane preparations from transfected HN9.10 cells that constitutively expressed the delta opioid receptor.
Residue:372
BDBM50064515
NameBDBM50064515
Synonyms:3-[(3R,4R)-3,4-Dimethyl-1-((E)-3-o-tolyl-allyl)-piperidin-4-yl]-phenol 3-[3,4-Dimethyl-1-(3-o-tolyl-allyl)-piperidin-4-yl]-phenol RTI-5989-25
TypeSmall organic molecule
Emp. Form.C23H29NO
Mol. Mass.335.4825
SMILESC[C@H]1CN(C\C=C\c2ccccc2C)CC[C@@]1(C)c1cccc(O)c1