Reaction Details
TargetMu-type opioid receptor
LigandBDBM50064517
Substrate/Competitorn/a
Meas. Tech.ChEMBL_149136 (CHEMBL759227)
Ki 203±n/a nM
Citation Thomas, JBMascarella, SWRothman, RBPartilla, JSXu, HMcCullough, KBDersch, CMCantrell, BEZimmerman, DMCarroll, FI Investigation of the N-substituent conformation governing potency and mu receptor subtype-selectivity in (+)-(3R, 4R)-dimethyl-4-(3-hydroxyphenyl)piperidine opioid antagonists. J Med Chem41:1980-90 (1998) 
 
Mu-type opioid receptor
Name:Mu-type opioid receptor
Type:G Protein-Coupled Receptor (GPCR)
Mol. Mass.:44503.11
Organism:Rattus norvegicus (rat)
Description:Competition binding assays were carried out using membrane preparations from transfected HN9.10 cells that constitutively expressed the mu opioid receptor.
Residue:398
BDBM50064517
NameBDBM50064517
Synonyms:3-[(3R,4R)-1-(3-Hydroxy-3-phenyl-cyclohexyl)-3,4-dimethyl-piperidin-4-yl]-phenol | CHEMBL444048
TypeSmall organic molecule
Emp. Form.C25H33NO2
Mol. Mass.379.535
SMILESC[C@H]1CN(CC[C@@]1(C)c1cccc(O)c1)C1CCCC(O)(C1)c1ccccc1