Reaction Details
TargetDelta-type opioid receptor
LigandBDBM50064523
Substrate/Competitorn/a
Meas. Tech.ChEMBL_147174 (CHEMBL754473)
Ki 931.0±n/a nM
Citation Thomas, JBMascarella, SWRothman, RBPartilla, JSXu, HMcCullough, KBDersch, CMCantrell, BEZimmerman, DMCarroll, FI Investigation of the N-substituent conformation governing potency and mu receptor subtype-selectivity in (+)-(3R, 4R)-dimethyl-4-(3-hydroxyphenyl)piperidine opioid antagonists. J Med Chem41:1980-90 (1998) 
 
Delta-type opioid receptor
Name:Delta-type opioid receptor
Type:G Protein-Coupled Receptor (GPCR)
Mol. Mass.:40465.04
Organism:Rattus norvegicus (rat)
Description:Competition binding assays were using CHO-K1 cell membranes expressing the opioid receptor.
Residue:372
BDBM50064523
NameBDBM50064523
Synonyms:3-[(3R,4R)-3,4-Dimethyl-1-((Z)-3-phenyl-allyl)-piperidin-4-yl]-phenol | CHEMBL64019
TypeSmall organic molecule
Emp. Form.C22H27NO
Mol. Mass.321.4559
SMILESC[C@H]1CN(C\C=C/c2ccccc2)CC[C@@]1(C)c1cccc(O)c1