Reaction Details
TargetMu-type opioid receptor
LigandBDBM50064521
Substrate/Competitorn/a
Meas. Tech.ChEMBL_149136 (CHEMBL759227)
Ki 0.74±n/a nM
Citation Thomas, JBMascarella, SWRothman, RBPartilla, JSXu, HMcCullough, KBDersch, CMCantrell, BEZimmerman, DMCarroll, FI Investigation of the N-substituent conformation governing potency and mu receptor subtype-selectivity in (+)-(3R, 4R)-dimethyl-4-(3-hydroxyphenyl)piperidine opioid antagonists. J Med Chem41:1980-90 (1998) 
 
Mu-type opioid receptor
Name:Mu-type opioid receptor
Type:G Protein-Coupled Receptor (GPCR)
Mol. Mass.:44503.11
Organism:Rattus norvegicus (rat)
Description:Competition binding assays were carried out using membrane preparations from transfected HN9.10 cells that constitutively expressed the mu opioid receptor.
Residue:398
BDBM50064521
NameBDBM50064521
Synonyms:3-[(3R,4R)-3,4-Dimethyl-1-((E)-3-phenyl-allyl)-piperidin-4-yl]-phenol CHEMBL51838
TypeSmall organic molecule
Emp. Form.C22H27NO
Mol. Mass.321.4559
SMILESC[C@H]1CN(C\C=C\c2ccccc2)CC[C@@]1(C)c1cccc(O)c1