Reaction Details
TargetKappa-type opioid receptor
LigandBDBM50064520
Substrate/Competitorn/a
Meas. Tech.ChEMBL_146678 (CHEMBL753170)
Ki>690±n/a nM
Citation Thomas, JBMascarella, SWRothman, RBPartilla, JSXu, HMcCullough, KBDersch, CMCantrell, BEZimmerman, DMCarroll, FI Investigation of the N-substituent conformation governing potency and mu receptor subtype-selectivity in (+)-(3R, 4R)-dimethyl-4-(3-hydroxyphenyl)piperidine opioid antagonists. J Med Chem41:1980-90 (1998) 
 
Kappa-type opioid receptor
Name:Kappa-type opioid receptor
Type:G Protein-Coupled Receptor (GPCR)
Mol. Mass.:42744.99
Organism:Cavia porcellus (domestic guinea pig)
Description:P41144
Residue:380
BDBM50064520
NameBDBM50064520
Synonyms:3-((3R,4R)-1-Benzo[b]thiophen-2-ylmethyl-3,4-dimethyl-piperidin-4-yl)-phenol | CHEMBL441049
TypeSmall organic molecule
Emp. Form.C22H25NOS
Mol. Mass.351.505
SMILESC[C@H]1CN(Cc2cc3ccccc3s2)CC[C@@]1(C)c1cccc(O)c1