Reaction Details
TargetDelta-type opioid receptor
LigandBDBM50064518
Substrate/Competitorn/a
Meas. Tech.ChEMBL_147174 (CHEMBL754473)
Ki 168±n/a nM
Citation Thomas, JBMascarella, SWRothman, RBPartilla, JSXu, HMcCullough, KBDersch, CMCantrell, BEZimmerman, DMCarroll, FI Investigation of the N-substituent conformation governing potency and mu receptor subtype-selectivity in (+)-(3R, 4R)-dimethyl-4-(3-hydroxyphenyl)piperidine opioid antagonists. J Med Chem41:1980-90 (1998) 
 
Delta-type opioid receptor
Name:Delta-type opioid receptor
Type:G Protein-Coupled Receptor (GPCR)
Mol. Mass.:40465.04
Organism:Rattus norvegicus (rat)
Description:Competition binding assays were using CHO-K1 cell membranes expressing the opioid receptor.
Residue:372
BDBM50064518
NameBDBM50064518
Synonyms:3-{(3R,4R)-1-[(E)-3-(2-Chloro-phenyl)-allyl]-3,4-dimethyl-piperidin-4-yl}-phenol CHEMBL50594 | RTI-5989-23
TypeSmall organic molecule
Emp. Form.C22H26ClNO
Mol. Mass.355.901
SMILESC[C@H]1CN(C\C=C\c2ccccc2Cl)CC[C@@]1(C)c1cccc(O)c1