Reaction Details
TargetVasopressin V2 receptor
LigandBDBM50065122
Substrate/Competitorn/a
Meas. Tech.ChEMBL_215173 (CHEMBL821346)
IC50 4±n/a nM
Citation Albright, JDReich, MFDelos Santos, EGDusza, JPSum, FWVenkatesan, AMCoupet, JChan, PSRu, XMazandarani, HBailey, T 5-Fluoro-2-methyl-N-[4-(5H-pyrrolo[2,1-c]-[1, 4]benzodiazepin-10(11H)-ylcarbonyl)-3-chlorophenyl]benzamide (VPA-985): an orally active arginine vasopressin antagonist with selectivity for V2 receptors. J Med Chem41:2442-4 (1998) 
 
Vasopressin V2 receptor
Name:Vasopressin V2 receptor
Type:Receptor
Mol. Mass.:40295.28
Organism:Homo sapiens (Human)
Description:P30518
Residue:371
BDBM50065122
NameBDBM50065122
Synonyms:CHEMBL306970 | N-[4-(5H,11H-Benzo[e]pyrrolo[1,2-a][1,4]diazepine-10-carbonyl)-phenyl]-2-chloro-4-fluoro-benzamide
TypeSmall organic molecule
Emp. Form.C26H19ClFN3O2
Mol. Mass.459.899
SMILESFc1ccc(C(=O)Nc2ccc(cc2)C(=O)N2Cc3cccn3Cc3ccccc23)c(Cl)c1