Reaction Details
TargetVasopressin V2 receptor
LigandBDBM50065111
Substrate/Competitorn/a
Meas. Tech.ChEMBL_215173 (CHEMBL821346)
IC50 1.9±n/a nM
Citation Albright, JDReich, MFDelos Santos, EGDusza, JPSum, FWVenkatesan, AMCoupet, JChan, PSRu, XMazandarani, HBailey, T 5-Fluoro-2-methyl-N-[4-(5H-pyrrolo[2,1-c]-[1, 4]benzodiazepin-10(11H)-ylcarbonyl)-3-chlorophenyl]benzamide (VPA-985): an orally active arginine vasopressin antagonist with selectivity for V2 receptors. J Med Chem41:2442-4 (1998) 
 
Vasopressin V2 receptor
Name:Vasopressin V2 receptor
Type:Receptor
Mol. Mass.:40295.28
Organism:Homo sapiens (Human)
Description:P30518
Residue:371
BDBM50065111
NameBDBM50065111
Synonyms:CHEMBL80029 | N-[4-(5H,11H-Benzo[e]pyrrolo[1,2-a][1,4]diazepine-10-carbonyl)-3-chloro-phenyl]-3-fluoro-2-methyl-benzamide
TypeSmall organic molecule
Emp. Form.C27H21ClFN3O2
Mol. Mass.473.926
SMILESCc1c(F)cccc1C(=O)Nc1ccc(C(=O)N2Cc3cccn3Cc3ccccc23)c(Cl)c1