Reaction Details
TargetVasopressin V2 receptor
LigandBDBM50065112
Substrate/Competitorn/a
Meas. Tech.ChEMBL_215173 (CHEMBL821346)
IC50 1.9±n/a nM
Citation Albright, JDReich, MFDelos Santos, EGDusza, JPSum, FWVenkatesan, AMCoupet, JChan, PSRu, XMazandarani, HBailey, T 5-Fluoro-2-methyl-N-[4-(5H-pyrrolo[2,1-c]-[1, 4]benzodiazepin-10(11H)-ylcarbonyl)-3-chlorophenyl]benzamide (VPA-985): an orally active arginine vasopressin antagonist with selectivity for V2 receptors. J Med Chem41:2442-4 (1998) 
 
Vasopressin V2 receptor
Name:Vasopressin V2 receptor
Type:Receptor
Mol. Mass.:40295.28
Organism:Homo sapiens (Human)
Description:P30518
Residue:371
BDBM50065112
NameBDBM50065112
Synonyms:CHEMBL81269 | N-[4-(5H,11H-Benzo[e]pyrrolo[1,2-a][1,4]diazepine-10-carbonyl)-2-methoxy-phenyl]-2,4-dichloro-benzamide
TypeSmall organic molecule
Emp. Form.C27H21Cl2N3O3
Mol. Mass.506.38
SMILESCOc1cc(ccc1NC(=O)c1ccc(Cl)cc1Cl)C(=O)N1Cc2cccn2Cc2ccccc12