Reaction Details
TargetVasopressin V2 receptor
LigandBDBM50065131
Substrate/Competitorn/a
Meas. Tech.ChEMBL_215174 (CHEMBL821347)
IC50 8±n/a nM
Citation Albright, JDReich, MFDelos Santos, EGDusza, JPSum, FWVenkatesan, AMCoupet, JChan, PSRu, XMazandarani, HBailey, T 5-Fluoro-2-methyl-N-[4-(5H-pyrrolo[2,1-c]-[1, 4]benzodiazepin-10(11H)-ylcarbonyl)-3-chlorophenyl]benzamide (VPA-985): an orally active arginine vasopressin antagonist with selectivity for V2 receptors. J Med Chem41:2442-4 (1998) 
 
Vasopressin V2 receptor
Name:Vasopressin V2 receptor
Type:G-protein coupled receptor
Mol. Mass.:40761.85
Organism:Rattus norvegicus (Rat)
Description:n/a
Residue:371
BDBM50065131
NameBDBM50065131
Synonyms:CHEMBL82376 | N-[4-(5H,11H-Benzo[e]pyrrolo[1,2-a][1,4]diazepine-10-carbonyl)-2-methyl-phenyl]-2,4-dichloro-benzamide
TypeSmall organic molecule
Emp. Form.C27H21Cl2N3O2
Mol. Mass.490.381
SMILESCc1cc(ccc1NC(=O)c1ccc(Cl)cc1Cl)C(=O)N1Cc2cccn2Cc2ccccc12