Reaction Details
TargetCathepsin K
LigandBDBM50066648
Substrate/Competitorn/a
Meas. Tech.ChEMBL_48326 (CHEMBL663316)
Ki 3.5±n/a nM
Citation Marquis, RWYamashita, DSRu, YLoCastro, SMOh, HJErhard, KFDesJarlais, RLHead, MSSmith, WWZhao, BJanson, CAAbdel-Meguid, SSTomaszek, TALevy, MAVeber, DF Conformationally constrained 1,3-diamino ketones: a series of potent inhibitors of the cysteine protease cathepsin K. J Med Chem41:3563-7 (1998) 
 
Cathepsin K
Name:Cathepsin K
Type:Enzyme
Mol. Mass.:36975.68
Organism:Homo sapiens (Human)
Description:P43235
Residue:329
BDBM50066648
NameBDBM50066648
Synonyms:((S)-3-Methyl-1-{3-[(S)-4-methyl-2-(pyridin-4-ylmethoxycarbonylamino)-pentanoylamino]-4-oxo-pyrrolidin-1-ylmethyl}-butyl)-carbamic acid benzyl ester | CHEMBL119285
TypeSmall organic molecule
Emp. Form.C31H43N5O6
Mol. Mass.581.703
SMILESCC(C)C[C@@H](CN1CC(NC(=O)[C@H](CC(C)C)NC(=O)OCc2ccncc2)C(=O)C1)NC(=O)OCc1ccccc1