Reaction Details
TargetReverse transcriptase/RNaseH
LigandBDBM50066932
Substrate/Competitorn/a
Meas. Tech.ChEMBL_195847 (CHEMBL799146)
IC50 490±n/a nM
Citation Nugent, RASchlachter, STMurphy, MJCleek, GJPoel, TJWishka, DGGraber, DRYagi, YKeiser, BJOlmsted, RAKopta, LASwaney, SMPoppe, SMMorris, JTarpley, WGThomas, RC Pyrimidine thioethers: a novel class of HIV-1 reverse transcriptase inhibitors with activity against BHAP-resistant HIV. J Med Chem41:3793-803 (1998) 
 
Reverse transcriptase/RNaseH
Name:Reverse transcriptase/RNaseH
Type:PROTEIN
Mol. Mass.:65229.15
Organism:Human immunodeficiency virus 1
Description:ChEMBL_1473730
Residue:566
BDBM50066932
NameBDBM50066932
Synonyms:6-Chloro-2-(3,4-dichloro-benzylsulfanyl)-pyrimidin-4-ylamine | CHEMBL124279
TypeSmall organic molecule
Emp. Form.C11H8Cl3N3S
Mol. Mass.320.625
SMILESNc1cc(Cl)nc(SCc2ccc(Cl)c(Cl)c2)n1