Reaction Details
TargetReverse transcriptase/RNaseH
LigandBDBM50066928
Substrate/Competitorn/a
Meas. Tech.ChEMBL_195847 (CHEMBL799146)
IC50 330±n/a nM
Citation Nugent, RASchlachter, STMurphy, MJCleek, GJPoel, TJWishka, DGGraber, DRYagi, YKeiser, BJOlmsted, RAKopta, LASwaney, SMPoppe, SMMorris, JTarpley, WGThomas, RC Pyrimidine thioethers: a novel class of HIV-1 reverse transcriptase inhibitors with activity against BHAP-resistant HIV. J Med Chem41:3793-803 (1998) 
 
Reverse transcriptase/RNaseH
Name:Reverse transcriptase/RNaseH
Type:PROTEIN
Mol. Mass.:65229.15
Organism:Human immunodeficiency virus 1
Description:ChEMBL_1473730
Residue:566
BDBM50066928
NameBDBM50066928
Synonyms:3-(4-Amino-6-chloro-pyrimidin-2-ylsulfanylmethyl)-benzoic acid methyl ester | CHEMBL125928
TypeSmall organic molecule
Emp. Form.C13H12ClN3O2S
Mol. Mass.309.771
SMILESCOC(=O)c1cccc(CSc2nc(N)cc(Cl)n2)c1