Reaction Details
TargetSubstance-P receptor
LigandBDBM50408664
Substrate/Competitorn/a
Meas. Tech.ChEMBL_205708 (CHEMBL807955)
IC50 0.080000±n/a nM
Citation Hale, JJMills, SGMacCoss, MFinke, PECascieri, MASadowski, SBer, EChicchi, GGKurtz, MMetzger, JEiermann, GTsou, NNTattersall, FDRupniak, NMWilliams, ARRycroft, WHargreaves, RMacIntyre, DE Structural optimization affording 2-(R)-(1-(R)-3, 5-bis(trifluoromethyl)phenylethoxy)-3-(S)-(4-fluoro)phenyl-4- (3-oxo-1,2,4-triazol-5-yl)methylmorpholine, a potent, orally active, long-acting morpholine acetal human NK-1 receptor antagonist. J Med Chem41:4607-14 (1998) 
 
Substance-P receptor
Name:Substance-P receptor
Type:G Protein-Coupled Receptor (GPCR)
Mol. Mass.:46254.43
Organism:Homo sapiens (Human)
Description:P25103
Residue:407
BDBM50408664
NameBDBM50408664
Synonyms:GR-205171 | VOFOPITANT
TypeSmall organic molecule
Emp. Form.C21H23F3N6O
Mol. Mass.432.4421
SMILESCOc1ccc(cc1CN[C@H]1CCCN[C@H]1c1ccccc1)-n1nnnc1C(F)(F)F