Reaction Details
TargetTelomerase reverse transcriptase
LigandBDBM50068330
Substrate/Competitorn/a
Meas. Tech.ChEMBL_210069 (CHEMBL813593)
IC50 2300±n/a nM
Citation Perry, PJReszka, APWood, AARead, MAGowan, SMDosanjh, HSTrent, JOJenkins, TCKelland, LRNeidle, S Human telomerase inhibition by regioisomeric disubstituted amidoanthracene-9,10-diones. J Med Chem41:4873-84 (1998) 
 
Telomerase reverse transcriptase
Name:Telomerase reverse transcriptase
Type:PROTEIN
Mol. Mass.:127099.03
Organism:Homo sapiens (Human)
Description:ChEMBL_1447029
Residue:1132
BDBM50068330
NameBDBM50068330
Synonyms:CHEMBL144848 | N-[9,10-Dioxo-5-(3-piperidin-1-yl-propionylamino)-9,10-dihydro-anthracen-1-yl]-3-piperidin-1-yl-propionamide
TypeSmall organic molecule
Emp. Form.C30H36N4O4
Mol. Mass.516.6312
SMILESO=C(CCN1CCCCC1)Nc1cccc2C(=O)c3c(NC(=O)CCN4CCCCC4)cccc3C(=O)c12