Reaction Details
TargetTelomerase reverse transcriptase
LigandBDBM50068328
Substrate/Competitorn/a
Meas. Tech.ChEMBL_210069 (CHEMBL813593)
IC50 3100±n/a nM
Citation Perry, PJReszka, APWood, AARead, MAGowan, SMDosanjh, HSTrent, JOJenkins, TCKelland, LRNeidle, S Human telomerase inhibition by regioisomeric disubstituted amidoanthracene-9,10-diones. J Med Chem41:4873-84 (1998) 
 
Telomerase reverse transcriptase
Name:Telomerase reverse transcriptase
Type:PROTEIN
Mol. Mass.:127099.03
Organism:Homo sapiens (Human)
Description:ChEMBL_1447029
Residue:1132
BDBM50068328
NameBDBM50068328
Synonyms:CHEMBL144303 | N-[9,10-Dioxo-4-(3-(N,N-diethyl-N-methyl-propionylamino)-9,10-dihydro-anthracen-1-yl]-3-(N,N-diethyl-N-methyl)-propionamide; diiodide
TypeSmall organic molecule
Emp. Form.C30H42N4O4
Mol. Mass.522.6778
SMILESCC[N+](C)(CC)CCC(=O)Nc1ccc(NC(=O)CC[N+](C)(CC)CC)c2C(=O)c3ccccc3C(=O)c12