Reaction Details
TargetTelomerase reverse transcriptase
LigandBDBM50068320
Substrate/Competitorn/a
Meas. Tech.ChEMBL_210069 (CHEMBL813593)
IC50 2000±n/a nM
Citation Perry, PJReszka, APWood, AARead, MAGowan, SMDosanjh, HSTrent, JOJenkins, TCKelland, LRNeidle, S Human telomerase inhibition by regioisomeric disubstituted amidoanthracene-9,10-diones. J Med Chem41:4873-84 (1998) 
 
Telomerase reverse transcriptase
Name:Telomerase reverse transcriptase
Type:PROTEIN
Mol. Mass.:127099.03
Organism:Homo sapiens (Human)
Description:ChEMBL_1447029
Residue:1132
BDBM50068320
NameBDBM50068320
Synonyms:2,7-Bis[3-(pyrrolidino)propionamido]anthraquinone N-[9,10-Dioxo-7-(3-pyrrolidin-1-yl-propionylamino)-9,10-dihydro-anthracen-2-yl]-3-pyrrolidin-1-yl-propionamide
TypeSmall organic molecule
Emp. Form.C28H32N4O4
Mol. Mass.488.5781
SMILESO=C(CCN1CCCC1)Nc1ccc2C(=O)c3ccc(NC(=O)CCN4CCCC4)cc3C(=O)c2c1